Micheal  Block

Micheal Block

1597392000

ionicでビルド時に「Crashlytics found an invalid API key: null」というエラーが発生する|teratail

ionicを勉強しているものです。ionicでFirebaseと連携してサインインとサインアップができるアプリケーションを実装しています。

端末で動作確認するためにビルドを行おうとしたのですが、以下のエラーにはまってしまいました。

このエラーについて調べてみたのですが、ionicでこのエラーが発生したことについての情報が少なく今のところ解決方法が見つかっておりません。ですが、何か有力な手掛かりがないか調査は続けています。

実装時は以下の動画を参考にしています。

https://www.youtube.com/watch?v=czQLa-iLljc

エラー内容

C:\Users\Wildf\sampleApp>ionic cordova build android
> ng.cmd run app:ionic-cordova-build --platform=android
Generating ES5 bundles for differential loading...
ES5 bundle generation complete.

chunk {polyfills} polyfills-es2015.js, polyfills-es2015.js.map (polyfills) 297 kB [initial] [rendered]
(中略)
> cordova.cmd build android
Preparing Firebase on Android

Subproject Path: CordovaLib
Subproject Path: app

(中略)
> Task :app:fabricGenerateResourcesDebug FAILED
ERROR - Crashlytics Developer Tools error.
java.lang.IllegalArgumentException: Crashlytics found an invalid API key: null.
Check the Crashlytics plugin to make sure that the application has been added successfully!
Contact [email protected] for assistance.
        at com.crashlytics.tools.android.DeveloperTools.processApiKey(DeveloperTools.java:375)
        at com.crashlytics.tools.android.DeveloperTools.processProperties(DeveloperTools.java:517)
        at com.crashlytics.tools.android.DeveloperTools.processArgsInternal(DeveloperTools.java:348)
        at com.crashlytics.tools.android.DeveloperTools.gradleMain(DeveloperTools.java:292)
        at sun.reflect.NativeMethodAccessorImpl.invoke0(Native Method)
        at sun.reflect.NativeMethodAccessorImpl.invoke(NativeMethodAccessorImpl.java:62)
        at sun.reflect.DelegatingMethodAccessorImpl.invoke(DelegatingMethodAccessorImpl.java:43)
        at java.lang.reflect.Method.invoke(Method.java:498)
        at org.codehaus.groovy.reflection.CachedMethod.invoke(CachedMethod.java:98)
        at groovy.lang.MetaMethod.doMethodInvoke(MetaMethod.java:325)
        at org.codehaus.groovy.runtime.callsite.StaticMetaMethodSite.invoke(StaticMetaMethodSite.java:46)
        at org.codehaus.groovy.runtime.callsite.StaticMetaMethodSite.call(StaticMetaMethodSite.java:91)
        at org.codehaus.groovy.runtime.callsite.AbstractCallSite.call(AbstractCallSite.java:128)
        at com.crashlytics.tools.gradle.tasks.FabricTaskBuilder.callDevtoolsWrappingRuntimeExceptions(FabricTaskBuilder.groovy:359)
        at com.crashlytics.tools.gradle.tasks.FabricTaskBuilder.this$2$callDevtoolsWrappingRuntimeExceptions(FabricTaskBuilder.groovy)
        at sun.reflect.NativeMethodAccessorImpl.invoke0(Native Method)
        at sun.reflect.NativeMethodAccessorImpl.invoke(NativeMethodAccessorImpl.java:62)
        at sun.reflect.DelegatingMethodAccessorImpl.invoke(DelegatingMethodAccessorImpl.java:43)
        at java.lang.reflect.Method.invoke(Method.java:498)
        at org.codehaus.groovy.reflection.CachedMethod.invoke(CachedMethod.java:98)
        at groovy.lang.MetaMethod.doMethodInvoke(MetaMethod.java:325)
        at org.codehaus.groovy.runtime.metaclass.ClosureMetaClass.invokeMethod(ClosureMetaClass.java:352)
        at groovy.lang.MetaClassImpl.invokeMethod(MetaClassImpl.java:1034)
        at org.codehaus.groovy.runtime.callsite.PogoMetaClassSite.callCurrent(PogoMetaClassSite.java:68)
        at org.codehaus.groovy.runtime.callsite.AbstractCallSite.callCurrent(AbstractCallSite.java:169)
        at com.crashlytics.tools.gradle.tasks.FabricTaskBuilder$_pluginGenerateResources_closure4.doCall(FabricTaskBuilder.groovy:132)
        at sun.reflect.NativeMethodAccessorImpl.invoke0(Native Method)
        at sun.reflect.NativeMethodAccessorImpl.invoke(NativeMethodAccessorImpl.java:62)
        at sun.reflect.DelegatingMethodAccessorImpl.invoke(DelegatingMethodAccessorImpl.java:43)
        at java.lang.reflect.Method.invoke(Method.java:498)
        at org.codehaus.groovy.reflection.CachedMethod.invoke(CachedMethod.java:98)
        at groovy.lang.MetaMethod.doMethodInvoke(MetaMethod.java:325)
        at org.codehaus.groovy.runtime.metaclass.ClosureMetaClass.invokeMethod(ClosureMetaClass.java:264)
        at groovy.lang.MetaClassImpl.invokeMethod(MetaClassImpl.java:1034)
        at groovy.lang.Closure.call(Closure.java:418)
        at groovy.lang.Closure.call(Closure.java:434)
        at org.gradle.api.internal.AbstractTask$ClosureTaskAction.execute(AbstractTask.java:739)
        at org.gradle.api.internal.AbstractTask$ClosureTaskAction.execute(AbstractTask.java:712)
        at org.gradle.api.internal.tasks.execution.ExecuteActionsTaskExecuter$1.run(ExecuteActionsTaskExecuter.java:131)
        at org.gradle.internal.operations.DefaultBuildOperationExecutor$RunnableBuildOperationWorker.execute(DefaultBuildOperationExecutor.java:301)
        at org.gradle.internal.operations.DefaultBuildOperationExecutor$RunnableBuildOperationWorker.execute(DefaultBuildOperationExecutor.java:293)
        at org.gradle.internal.operations.DefaultBuildOperationExecutor.execute(DefaultBuildOperationExecutor.java:175)
        at org.gradle.internal.operations.DefaultBuildOperationExecutor.run(DefaultBuildOperationExecutor.java:91)
        at org.gradle.internal.operations.DelegatingBuildOperationExecutor.run(DelegatingBuildOperationExecutor.java:31)
        at org.gradle.api.internal.tasks.execution.ExecuteActionsTaskExecuter.executeAction(ExecuteActionsTaskExecuter.java:120)
        at org.gradle.api.internal.tasks.execution.ExecuteActionsTaskExecuter.executeActions(ExecuteActionsTaskExecuter.java:99)
        at org.gradle.api.internal.tasks.execution.ExecuteActionsTaskExecuter.execute(ExecuteActionsTaskExecuter.java:77)
        at org.gradle.api.internal.tasks.execution.OutputDirectoryCreatingTaskExecuter.execute(OutputDirectoryCreatingTaskExecuter.java:51)
        at org.gradle.api.internal.tasks.execution.SkipUpToDateTaskExecuter.execute(SkipUpToDateTaskExecuter.java:59)
        at org.gradle.api.internal.tasks.execution.ResolveTaskOutputCachingStateExecuter.execute(ResolveTaskOutputCachingStateExecuter.java:54)
        at org.gradle.api.internal.tasks.execution.ValidatingTaskExecuter.execute(ValidatingTaskExecuter.java:59)
        at org.gradle.api.internal.tasks.execution.SkipEmptySourceFilesTaskExecuter.execute(SkipEmptySourceFilesTaskExecuter.java:101)
        at org.gradle.api.internal.tasks.execution.FinalizeInputFilePropertiesTaskExecuter.execute(FinalizeInputFilePropertiesTaskExecuter.java:44)
        at org.gradle.api.internal.tasks.execution.CleanupStaleOutputsExecuter.execute(CleanupStaleOutputsExecuter.java:91)
        at org.gradle.api.internal.tasks.execution.ResolveTaskArtifactStateTaskExecuter.execute(ResolveTaskArtifactStateTaskExecuter.java:62)
        at org.gradle.api.internal.tasks.execution.SkipTaskWithNoActionsExecuter.execute(SkipTaskWithNoActionsExecuter.java:59)
        at org.gradle.api.internal.tasks.execution.SkipOnlyIfTaskExecuter.execute(SkipOnlyIfTaskExecuter.java:54)
        at org.gradle.api.internal.tasks.execution.ExecuteAtMostOnceTaskExecuter.execute(ExecuteAtMostOnceTaskExecuter.java:43)
        at org.gradle.api.internal.tasks.execution.CatchExceptionTaskExecuter.execute(CatchExceptionTaskExecuter.java:34)
        at org.gradle.api.internal.tasks.execution.EventFiringTaskExecuter$1.run(EventFiringTaskExecuter.java:51)
        at org.gradle.internal.operations.DefaultBuildOperationExecutor$RunnableBuildOperationWorker.execute(DefaultBuildOperationExecutor.java:301)
        at org.gradle.internal.operations.DefaultBuildOperationExecutor$RunnableBuildOperationWorker.execute(DefaultBuildOperationExecutor.java:293)
        at org.gradle.internal.operations.DefaultBuildOperationExecutor.execute(DefaultBuildOperationExecutor.java:175)
        at org.gradle.internal.operations.DefaultBuildOperationExecutor.run(DefaultBuildOperationExecutor.java:91)
        at org.gradle.internal.operations.DelegatingBuildOperationExecutor.run(DelegatingBuildOperationExecutor.java:31)
        at org.gradle.api.internal.tasks.execution.EventFiringTaskExecuter.execute(EventFiringTaskExecuter.java:46)
        at org.gradle.execution.taskgraph.LocalTaskInfoExecutor.execute(LocalTaskInfoExecutor.java:42)
        at org.gradle.execution.taskgraph.DefaultTaskExecutionGraph$BuildOperationAwareWorkItemExecutor.execute(DefaultTaskExecutionGraph.java:277)
        at org.gradle.execution.taskgraph.DefaultTaskExecutionGraph$BuildOperationAwareWorkItemExecutor.execute(DefaultTaskExecutionGraph.java:262)
        at org.gradle.execution.taskgraph.DefaultTaskPlanExecutor$ExecutorWorker$1.execute(DefaultTaskPlanExecutor.java:135)

FAILURE: Build failed with an exception.
(中略)

BUILD FAILED in 17s
[ERROR] An error occurred while running subprocess cordova.

        cordova.cmd build android exited with exit code 1.

        Re-running this command with the --verbose flag may provide more information.

Firebaseと連携するときにCrashlyticsの設定するといった記述や説明もなかったのでなぜこのようなエラーが発生するのか理解できておりません。ionicに詳しい方がいましたらご回答いただけないでしょうか?

  • attachmentクリップ0
  • thumb_up高評価0
  • rate_review追記・修正依頼
  • 低評価0

まだ回答がついていません

15分調べてもわからないことは、teratailで質問しよう!

  • ただいまの回答率 89.05%
  • 質問をまとめることで、思考を整理して素早く解決
  • テンプレート機能で、簡単に質問をまとめられる

質問する

#api #coding #api key #null

ionicでビルド時に「Crashlytics found an invalid API key: null」というエラーが発生する|teratail